1,2-Dihexylcyclopropene

Condensed phase thermochemistry data

Data compiled by: Hussein Y. Afeefy, Joel F. Liebman, and Stephen E. Stein

Quantity Value Units Method Reference Comment
Δcliquid-9445.6kJ/molCcbGollis, Belenyessy, et al., 1962Corresponding Δfliquid = -458.7 kJ/mol (simple calculation by NIST; no Washburn corrections)
Quantity Value Units Method Reference Comment
Δcsolid-9058.kJ/molCcbSerijan and Wise, 1951Corresponding Δfsolid = -845. kJ/mol (simple calculation by NIST; no Washburn corrections)

References

Gollis, Belenyessy, et al., 1962
Gollis, M.H.; Belenyessy, L.I.; Gudzinowicz, B.J.; Koch, S.D.; Smith, J.O.; Wineman, R.J., Evaluation of pure hydrocarbons as jet fuels, J. Chem. Eng. Data, 1962, 7, 331-316. [all data]

Serijan and Wise, 1951
Serijan, K.T.; Wise, P.H., Dicyclic hydrocarbons. III. Diphenyl- and dicyclohexylalkanes through C15, J. Am. Chem. Soc., 1951, 73, 4766-4769. [all data]