cis-2-Methyl-7-octadecene

Van Den Dool and Kratz RI, non-polar column, custom temperature program

View large format table.

Column type Active phase I Reference Comment
CapillaryDB-51926.Gries R., Khaskin G., et al., 2005Column length: 30. m; Program: not specified

Normal alkane RI, non-polar column, custom temperature program

View large format table.

Column type Active phase I Reference Comment
CapillaryDB-51842.Gries, Schaefer, et al., 200130. m/0.25 mm/0.32 μm; Program: not specified

References

Gries R., Khaskin G., et al., 2005
Gries R.; Khaskin G.; Gotoh T.; Schaefer P.W.; Gries G., (7Z,9E)-2-methyl-7,9-octadecadiene: A sex pheromone component of Lymantria bantaizana, J. Chem. Ecol., 2005, 31, 4, 879-891, https://doi.org/10.1007/s10886-005-3550-z . [all data]

Gries, Schaefer, et al., 2001
Gries, G.; Schaefer, P.W.; Gries, R.; Liska, J.; Gotoh, T., Reproductive character displacement in Lymantria monacha from Northern Japan, J. Chem. Ecol., 2001, 27, 6, 1163-1176, https://doi.org/10.1023/A:1010316029165 . [all data]