Fosazepam

Kovats' RI, non-polar column, isothermal

View large format table.

Column type Active phase Temperature (C) I Reference Comment
PackedSE-30250.2605.Schuetz and Westenberger, 1979N2, Chromosorb G AW DMCS (80-100 mesh); Column length: 1.5 m
PackedSE-30280.2615.Schuetz and Westenberger, 1979N2, Chromosorb G AW DMCS (80-100 mesh); Column length: 1.5 m

Normal alkane RI, non-polar column, custom temperature program

View large format table.

Column type Active phase I Reference Comment
OtherMethyl Silicone2610.Ardrey and Moffat, 1981Program: not specified

References

Schuetz and Westenberger, 1979
Schuetz, H.; Westenberger, V., Gas chromatographic data of 31 benzodiazepines and metabolites, J. Chromatogr., 1979, 169, 409-411, https://doi.org/10.1016/0021-9673(75)85071-0 . [all data]

Ardrey and Moffat, 1981
Ardrey, R.E.; Moffat, A.C., Gas-liquid chromatographic retention indices of 1318 substances of toxicological interest on SE-30 or OV-1 stationary phase, J. Chromatogr., 1981, 220, 3, 195-252, https://doi.org/10.1016/S0021-9673(00)81925-1 . [all data]