Stannane, cyclohexyltrimethyl-

Kovats' RI, non-polar column, isothermal

View large format table.

Column type Active phase Temperature (C) I Reference Comment
PackedApiezon L190.1208.Putnam and Pu, 1965Celite; Column length: 1. m

Van Den Dool and Kratz RI, non-polar column, temperature ramp

View large format table.

Column type Active phase I Reference Comment
PackedApiezon L1160.Putnam and Pu, 1965, 2Celite, 10. K/min; Column length: 3. m; Tstart: 60. C
PackedApiezon L1168.Putnam and Pu, 1965, 2Celite, 15. K/min; Column length: 3. m; Tstart: 60. C
PackedApiezon L1157.Putnam and Pu, 1965, 2Celite, 6. K/min; Column length: 3. m; Tstart: 60. C

References

Putnam and Pu, 1965
Putnam, R.C.; Pu, H., Retention indices of organotins, J. Gas Chromatogr., 1965, 3, 5, 160-164, https://doi.org/10.1093/chromsci/3.5.160 . [all data]

Putnam and Pu, 1965, 2
Putnam, R.C.; Pu, H., Retention indices of organotins (II), J. Gas Chromatogr., 1965, 3, 9, 289-293, https://doi.org/10.1093/chromsci/3.9.289 . [all data]