Benzenamine, 2-chloro-4,6-dinitro-

Phase change data

Data compiled by: William E. Acree, Jr., James S. Chickos

Quantity Value Units Method Reference Comment
Δsub115.0 ± 0.9kJ/molMERibeiro da Silva, Ribeiro da Silva, et al., 2010Based on data from 358. - 380. K.

Enthalpy of sublimation

ΔsubH (kJ/mol) Temperature (K) Method Reference Comment
114.2 ± 0.5369.MERibeiro da Silva, Ribeiro da Silva, et al., 2010Based on data from 358. - 380. K.

References

Ribeiro da Silva, Ribeiro da Silva, et al., 2010
Ribeiro da Silva, Manuel A.V.; Ribeiro da Silva, Maria D.M.C.; Santos, Ana Filipa L.O.M.; Ferreira, Ana I.M.C. Lobo; Galvão, Tiago L.P., Experimental thermochemical study of two chlorodinitroaniline isomers, The Journal of Chemical Thermodynamics, 2010, 42, 4, 496-501, https://doi.org/10.1016/j.jct.2009.11.003 . [all data]