2-Tellurophenecarboxaldehyde

Gas phase ion energetics data

Data compiled by: Sharon G. Lias, Rhoda D. Levin, and Sherif A. Kafafi

Ionization energy determinations

IE (eV) Method Reference
8.9 ± 0.1EIDistefano, Pignataro, et al., 1973

References

Distefano, Pignataro, et al., 1973
Distefano, G.; Pignataro, S.; Innorta, G.; Fringuelli, F.; Marino, G.; Taticchi, A., Ionization energies of selenophen, tellurophen and some of their derivatives, Chem. Phys. Lett., 1973, 22, 132. [all data]