2-Tellurophenecarboxylic acid

Gas phase ion energetics data

Data compiled by: Sharon G. Lias, Rhoda D. Levin, and Sherif A. Kafafi

Ionization energy determinations

IE (eV) Method Reference Comment
8.8 ± 0.1EIDistefano, Pignataro, et al., 1973
8.62 ± 0.05PEFringuelli, Marino, et al., 1976Vertical value

References

Distefano, Pignataro, et al., 1973
Distefano, G.; Pignataro, S.; Innorta, G.; Fringuelli, F.; Marino, G.; Taticchi, A., Ionization energies of selenophen, tellurophen and some of their derivatives, Chem. Phys. Lett., 1973, 22, 132. [all data]

Fringuelli, Marino, et al., 1976
Fringuelli, F.; Marino, G.; Taticchi, A.; Distefano, G.; Colonna, F.P.; Pignataro, S., Photoelectron spectra of the α-substituted derivatives of furan, thiophen, selenophen, and tellurophen. A comparative study of the molecular orbital energies, J. Chem. Soc. Perkin Trans. 2, 1976, 276. [all data]