Octanoic acid, 5-(acetyloxy)-, methyl ester

Van Den Dool and Kratz RI, non-polar column, temperature ramp

Data compiled by: NIST Mass Spectrometry Data Center, William E. Wallace, director

Column type Capillary
Active phase DB-1
Column length (m) 50.
Carrier gas He
Substrate
Column diameter (mm) 0.32
Phase thickness (μm) 1.05
Tstart (C) 40.
Tend (C) 260.
Heat rate (K/min) 2.
Initial hold (min)
Final hold (min) 40.
I 1385.
ReferenceWu, Kuo, et al., 1991
Comment MSDC-RI

References

Wu, Kuo, et al., 1991
Wu, P.; Kuo, M.-C.; Hartman, T.G.; Rosen, R.T.; Ho, C.-T., Free and glycosidically bound aroma compounds in pineapple (Ananas comosus L. Merr.), J. Agric. Food Chem., 1991, 39, 1, 170-172, https://doi.org/10.1021/jf00001a033 . [all data]