methyl 5-acetoxyhexanoate

Normal alkane RI, polar column, temperature ramp

Data compiled by: NIST Mass Spectrometry Data Center, William E. Wallace, director

Column type Capillary
Active phase DB-Wax
Column length (m) 60.
Carrier gas He
Substrate
Column diameter (mm) 0.32
Phase thickness (μm) 0.25
Tstart (C) 30.
Tend (C) 180.
Heat rate (K/min) 2.
Initial hold (min) 4.
Final hold (min)
I 1759.
ReferenceTakeoka and Butter, 1989
Comment MSDC-RI

Van Den Dool and Kratz RI, non-polar column, temperature ramp

Data compiled by: NIST Mass Spectrometry Data Center, William E. Wallace, director

Column type Capillary
Active phase DB-1
Column length (m) 50.
Carrier gas He
Substrate
Column diameter (mm) 0.32
Phase thickness (μm) 1.05
Tstart (C) 40.
Tend (C) 260.
Heat rate (K/min) 2.
Initial hold (min)
Final hold (min) 40.
I 1220.
ReferenceWu, Kuo, et al., 1991
Comment MSDC-RI

References

Takeoka and Butter, 1989
Takeoka, G.; Butter, R.G., Volatile constituents of pineapple (Ananas Comosus [L.] Merr.) in Flavor Chemistry. Trends and Developments, Teranishi,R.; Buttery,R.G.; Shahidi,F., ed(s)., American Chemical Society, Washington, DC, 1989, 223-237. [all data]