Tricyclo[8.2.2.2<sup>4,7</sup>]hexadeca-4,6,10,12,13,15-hexaene,5,11,13,15-tetramethyl-,stereoisomer

Gas phase ion energetics data

Data compiled by: Sharon G. Lias, Rhoda D. Levin, and Sherif A. Kafafi

Ionization energy determinations

IE (eV) Method Reference Comment
7.2PEZhong-zhi, Kovak, et al., 1981
7.75 ± 0.05PEZhong-zhi, Kovak, et al., 1981Vertical value
7.52PEKoenig and Southworth, 1977Vertical value

References

Zhong-zhi, Kovak, et al., 1981
Zhong-zhi, Y.; Kovak, B.; Heilbronner, E.; Eltamany, S.; Hopf, H., 192. Ionization energies of methyl-substituted [2.2] paracyclophanes, Helv. Chim. Acta, 1981, 64, 1991. [all data]

Koenig and Southworth, 1977
Koenig, T.; Southworth, S., The He I photoelectron spectrum of 3,7-dimethyl-p-quinodimethane. A non-Koopmans theorem effect, J. Am. Chem. Soc., 1977, 99, 2807. [all data]