Dilead dioxide

Gas phase ion energetics data

Data compiled by: Henry M. Rosenstock, Keith Draxl, Bruce W. Steiner, and John T. Herron

Ionization energy determinations

IE (eV) Method Reference
9.1 ± 0.5EIUy and Drowart, 1969
8.8 ± 0.5EIDrowart, Colin, et al., 1965

Appearance energy determinations

Ion AE (eV) Other Products MethodReferenceComment
Pb2O+11.9 ± 1.0OEIDrowart, Colin, et al., 1965

References

Uy and Drowart, 1969
Uy, O.M.; Drowart, J., Mass spectrometric determination of the dissociation energies of the molecules BiO, BiS, BiSe and BiTe, J. Chem. Soc. Faraday Trans., 1969, 65, 3221. [all data]

Drowart, Colin, et al., 1965
Drowart, J.; Colin, R.; Exsteen, G., Mass spectrometric study of the vaporization of lead monoxide. Dissociation energy of PbO, J. Chem. Soc. Faraday Trans., 1965, 61, 1376. [all data]