8-octadecyne

Phase change data

Data compiled by: Thermodynamics Research Center, NIST Boulder Laboratories, Chris Muzny director

Quantity Value Units Method Reference Comment
Tfus270.7KN/AElsner and Paul, 1951Uncertainty assigned by TRC = 2. K

In addition to the Thermodynamics Research Center (TRC) data available from this site, much more physical and chemical property data is available from the following TRC products:

References

Elsner and Paul, 1951
Elsner, B.B.; Paul, P.F.M., The application of lithium alkynyls in the synthesis of long-chain dialkylacetylenes, J. Chem. Soc., 1951, 1951, 893. [all data]