4,12-Dimethylbenz[a]anthracene

Gas phase ion energetics data

Data compiled as indicated in comments:
LLK - Sharon G. Lias, Rhoda D. Levin, and Sherif A. Kafafi

Ionization energy determinations

IE (eV) Method Reference Comment
7.18 ± 0.03PEAkiyama, Harvey, et al., 1981LLK

References

Akiyama, Harvey, et al., 1981
Akiyama, I.; Harvey, R.G.; LeBreton, P.R., Ultraviolet photoelectron studies of methyl-substituted benz[a]anthracenes, J. Am. Chem. Soc., 1981, 103, 6330. [all data]