2-Isopropyl-5-methylhex-2-enal

Van Den Dool and Kratz RI, non-polar column, temperature ramp

View large format table.

Column type Active phase I Reference Comment
CapillaryHP-11100.Oh, Shu, et al., 199250. m/0.32 mm/1.05 μm, He, 2. K/min, 260. C @ 40. min; Tstart: 40. C

Van Den Dool and Kratz RI, non-polar column, custom temperature program

View large format table.

Column type Active phase I Reference Comment
CapillaryDB-51106.Beal and Mottram, 199430. m/0.32 mm/1.0 μm, He; Program: 5 0C (0.5 min) -> (1 min) 60 0C (5 min) 4 0C/min -> 250 0C

Van Den Dool and Kratz RI, polar column, custom temperature program

View large format table.

Column type Active phase I Reference Comment
CapillaryBP-201378.Beal and Mottram, 199450. m/0.32 mm/0.5 μm, He; Program: 5 0C (0.5 min) -> (1 min) 60 0C (5 min) 4 0C/min -> 200 0C

Normal alkane RI, non-polar column, custom temperature program

View large format table.

Column type Active phase I Reference Comment
CapillaryDB-51097.Yu and Zhang, 201030. m/0.25 mm/0.25 μm; Program: 40 0C (5 min) 5 0C/min -> 260 0C 15 0C/min -> 280 0C (1 min)
CapillaryHP-51106.Splivallo, Bossi, et al., 2007He; Program: 50C => 3C/min => 200C(10min) => 10C/min => 290C(10min)
CapillaryHP-51119.Splivallo, Bossi, et al., 2007He; Program: 50C => 3C/min => 200C(10min) => 10C/min => 290C(10min)
CapillaryCP Sil 5 CB1094.Counet, Ouwerx, et al., 200450. m/0.32 mm/1.2 μm; Program: 36C => 20C/min => 85C => 1C/min => 145C => 3C/min => 250C(30min)

Normal alkane RI, polar column, temperature ramp

View large format table.

Column type Active phase I Reference Comment
CapillaryTC-Wax1373.Ishizaki, Tachihara, et al., 200560. m/0.25 mm/0.25 μm, N2, 3. K/min, 220. C @ 40. min; Tstart: 70. C

Normal alkane RI, polar column, custom temperature program

View large format table.

Column type Active phase I Reference Comment
CapillaryTC-Wax1373.Tachihara, Ishizaki, et al., 2004Program: not specified

References

Oh, Shu, et al., 1992
Oh, Y.-C.; Shu, C.-K.; Ho, C.-T., Formation of novel 2(1H)-pyrazinones as peptide-specific Maillard reaction products, J. Agric. Food Chem., 1992, 40, 1, 118-121, https://doi.org/10.1021/jf00013a022 . [all data]

Beal and Mottram, 1994
Beal, A.D.; Mottram, D.S., Compounds contributing to the characteristic aroma of malted barley, J. Agric. Food Chem., 1994, 42, 12, 2880-2884, https://doi.org/10.1021/jf00048a043 . [all data]

Yu and Zhang, 2010
Yu, A.-N.; Zhang, A.-D., The effect of pH on the total formation of aroma compounds produced by hearting a model system containing L-ascorbic acid with L-threonine/L-serine, Food Chem., 2010, 119, 1, 214-219, https://doi.org/10.1016/j.foodchem.2009.06.026 . [all data]

Splivallo, Bossi, et al., 2007
Splivallo, R.; Bossi, S.; Maffei, M.; Bonfante, P., Discrimination of truffle fruiting body versus mycelial aromas by stir bar sorptive extraction, Phytochemistry, 2007, 68, 20, 2584-2598, https://doi.org/10.1016/j.phytochem.2007.03.030 . [all data]

Counet, Ouwerx, et al., 2004
Counet, C.; Ouwerx, C.; Rosoux, D.; Collin, S., Relationship between procyanidin and flavor contents of cocoa liquors from different origins, J. Agric. Food Chem., 2004, 52, 20, 6243-6249, https://doi.org/10.1021/jf040105b . [all data]

Ishizaki, Tachihara, et al., 2005
Ishizaki, S.; Tachihara, T.; Tamura, H.; Yanai, T.; Kitahara, T., Evaluation of odour-active compounds in roasted shrimp (Sergia lucens Hansen) by aroma extract dilution analysis, Flavour Fragr. J., 2005, 20, 6, 562-566, https://doi.org/10.1002/ffj.1484 . [all data]

Tachihara, Ishizaki, et al., 2004
Tachihara, T.; Ishizaki, S.; Ishikawa, M.; Kitahara, T., Studies on the volatile compounds of roasted spotted shrimp, Chemistry Biodiversity, 2004, 1, 12, 2024-2033, https://doi.org/10.1002/cbdv.200490155 . [all data]