cis-3-Hexenyl isovalerate

Kovats' RI, non-polar column, custom temperature program

Data compiled by: NIST Mass Spectrometry Data Center, William E. Wallace, director

Column type Capillary
Active phase DB-5MS
Column length (m) 30.
Carrier gas He
Substrate
Column diameter (mm) 0.25
Phase thickness (μm) 0.25
Program 40C => 2C/min => 60C => 4C/min => 260C
I 1235.
ReferenceMaia, Andrade, et al., 2000
Comment MSDC-RI

References

Maia, Andrade, et al., 2000
Maia, J.G.S.; Andrade, E.H.A.; Zoghbi, M.G.B., Volatile constituents of the leaves, fruits and flowers of cashew ( Anacardium occidentaleL.), J. Food Comp. Anal., 2000, 13, 3, 227-232, https://doi.org/10.1006/jfca.2000.0894 . [all data]