acetic acid tetradec-10-enyl ester, cis

Phase change data

Data compiled by: William E. Acree, Jr., James S. Chickos

Quantity Value Units Method Reference Comment
Δvap89.6kJ/molGCKoutek, Hoskovec, et al., 1997Based on data from 353. - 398. K. See also Ova, Koultek, et al., 2000.

Van Den Dool and Kratz RI, non-polar column, temperature ramp

View large format table.

Column type Active phase I Reference Comment
CapillaryDB-51807.Marques, McElfresh, et al., 200030. m/0.25 mm/0.25 μm, 100. C @ 1. min, 5. K/min, 275. C @ 3. min

Van Den Dool and Kratz RI, polar column, temperature ramp

View large format table.

Column type Active phase I Reference Comment
CapillaryDB-Wax2128.Marques, McElfresh, et al., 200030. m/0.32 mm/0.25 μm, 100. C @ 1. min, 5. K/min; Tend: 240. C

Normal alkane RI, polar column, temperature ramp

View large format table.

Column type Active phase I Reference Comment
CapillaryHP-Wax2166.6Subchev, Mircheva, et al., 2003H2, 40. C @ 1. min, 10. K/min; Column length: 30. m; Column diameter: 0.3 mm; Tend: 220. C

Normal alkane RI, polar column, custom temperature program

View large format table.

Column type Active phase I Reference Comment
CapillaryFFAP2138.5Subchev, Mircheva, et al., 2003Program: not specified

References

Koutek, Hoskovec, et al., 1997
Koutek, Bohumír; Hoskovec, Michal; Vrkocová, Pavlína; Feltl, Ladislav, Gas chromatographic determination of vapour pressures of pheromone-like compounds IV. Acetates, a reinvestigation, Journal of Chromatography A, 1997, 759, 1-2, 93-109, https://doi.org/10.1016/S0021-9673(96)00775-3 . [all data]

Ova, Koultek, et al., 2000
Ova, P.V.; Koultek, B.; Hoskovec, M., Practice Oriented Results on Use and Production of Neem Ingredients and Pheromones VI, H. Kleeberg and C.P.W. Zebitz, ed(s)., Druck and Graphic, Giessen, 2000, 211-218. [all data]

Marques, McElfresh, et al., 2000
Marques, F.A.; McElfresh, J.S.; Millar, J.G., Kováts retention indexes of monounsaturated C12, C14, and C16 alcohols, acetates and aldehydes commonly found in lepidopteran pheromone blends, J. Braz. Chem. Soc., 2000, 11, 6, 592-599, https://doi.org/10.1590/S0103-50532000000600007 . [all data]

Subchev, Mircheva, et al., 2003
Subchev, M.; Mircheva, A.; Pickett, J.; Wadhams, L.; Woodcock, C.; dos Santos, A.; Francke, S.; Francke, W., Sex pheromone of the leaf-miner Phyllonorycter platani: (Z10)-tetradecenyl acetate, J. Chem. Ecol., Rapid Communication, 2003, rc93-rc98. [all data]