3,4-Dimethyl-2,5-bis(trimethylsilyl)thiophene

Gas phase ion energetics data

Data compiled by: Sharon G. Lias, John E. Bartmess, Joel F. Liebman, John L. Holmes, Rhoda D. Levin, and W. Gary Mallard

Ionization energy determinations

IE (eV) Method Reference Comment
7.84PEBock and Roth, 1983Vertical value

References

Bock and Roth, 1983
Bock, H.; Roth, B., Radical ions. 49. Redox reactions of some thiophene derivatives, Phosphorus Sulfur, 1983, 14, 211. [all data]