2-Methoxy-4'-pentoxy-trans-stilbene

Phase change data

Data compiled as indicated in comments:
TRC - Thermodynamics Research Center, NIST Boulder Laboratories, Chris Muzny director
DH - Eugene S. Domalski and Elizabeth D. Hearing

Quantity Value Units Method Reference Comment
Tfus435.KN/AYoung, Haller, et al., 1972Uncertainty assigned by TRC = 1. K; TRC

Enthalpy of fusion

ΔfusH (kJ/mol) Temperature (K) Reference Comment
41.170435.Young, Haller, et al., 1972, 2Crystal-isotropic liquid transition.; DH

Entropy of fusion

ΔfusS (J/mol*K) Temperature (K) Reference Comment
94.6435.Young, Haller, et al., 1972, 2Crystal-isotropic; DH

Enthalpy of phase transition

ΔHtrs (kJ/mol) Temperature (K) Initial Phase Final Phase Reference Comment
0.782427.liquidliquidYoung, Haller, et al., 1972, 2DH

Entropy of phase transition

ΔStrs (J/mol*K) Temperature (K) Initial Phase Final Phase Reference Comment
1.8427.liquid, Nematicliquid, isotropicYoung, Haller, et al., 1972, 2DH

In addition to the Thermodynamics Research Center (TRC) data available from this site, much more physical and chemical property data is available from the following TRC products:

References

Young, Haller, et al., 1972
Young, W.R.; Haller, I.; Aviram, A., Mesomorphism in the 4,4'-dialkoxy-trans-stilbene, Mol. Cryst. Liq. Cryst., 1972, 15, 311. [all data]

Young, Haller, et al., 1972, 2
Young, W.R.; Haller, I.; Aviram, A., Mesomorphism in the 4,4'-dialkoxy-trans-stilbenes, Mol. Cryst. Liq. Cryst., 1972, 15, 311-317. [all data]