Valerena-4,7(11)-diene

Van Den Dool and Kratz RI, non-polar column, custom temperature program

View large format table.

Column type Active phase I Reference Comment
CapillaryHP-5MS1465.3Andriamaharavo, 201430. m/0.25 mm/0.25 μm, He; Program: 60C (1 min) => 5 C/min => 210C => 10 C/min => 280C (15 min)
CapillaryCP Sil 5 CB1456.Paul, König, et al., 2001H2; Column length: 25. m; Program: not specified

Normal alkane RI, non-polar column, temperature ramp

View large format table.

Column type Active phase I Reference Comment
CapillaryHP-5MS1455.4Zizovic, Stamenic, et al., 200730. m/0.25 mm/0.25 μm, He, 4. K/min; Tstart: 40. C; Tend: 260. C

References

Andriamaharavo, 2014
Andriamaharavo, N.R., Retention Data. NIST Mass Spectrometry Data Center., NIST Mass Spectrometry Data Center, 2014. [all data]

Paul, König, et al., 2001
Paul, C.; König, W.A.; Muhle, H., Pacifigorgianes and tamariscene as constituents of Frullania tamarisci and Valeriana officinalis, Phytochemistry, 2001, 57, 2, 307-313, https://doi.org/10.1016/S0031-9422(01)00018-8 . [all data]

Zizovic, Stamenic, et al., 2007
Zizovic, I.; Stamenic, M.; Ivanovic, J.; Orlovic, A.; Ristic, M.; Djordjevic, S.; Petrovic, S.D.; Skala, D., Supercritical carbon dioxide extraction of sesquiterpenes from valerian root, J. Supercrit. Fluids, 2007, 43, 2, 249-258, https://doi.org/10.1016/j.supflu.2007.05.007 . [all data]