Dihydro-3,3,4,4-tetramethyl-2,5-furandione

Condensed phase thermochemistry data

Data compiled by: Hussein Y. Afeefy, Joel F. Liebman, and Stephen E. Stein

Quantity Value Units Method Reference Comment
Δcsolid-4150.2 ± 2.1kJ/molCcbVerkade and Hartman, 1933Reanalyzed by Cox and Pilcher, 1970, Original value = -4154.0 kJ/mol; Corresponding Δfsolid = -712.83 kJ/mol (simple calculation by NIST; no Washburn corrections)

Reaction thermochemistry data

Data compiled by: Hussein Y. Afeefy, Joel F. Liebman, and Stephen E. Stein

Individual Reactions

Dihydro-3,3,4,4-tetramethyl-2,5-furandione + Water = Tetramethylbutanedioic acid

By formula: C8H12O3 + H2O = C8H14O4

Quantity Value Units Method Reference Comment
Δr-35.3kJ/molCmConn, Kistiakowsky, et al., 1942liquid phase; Heat of hydrolysis at 323 K

References

Verkade and Hartman, 1933
Verkade, P.E.; Hartman, H., Calorimetric researches XXI. Heats of combustion of methyl-, ethyl- and phenyl-substituted succinic acids and of their anhydrides: a. Experimental data, Rec. Trav. Chim. Pays/Bas, 1933, 52, 945-968. [all data]

Cox and Pilcher, 1970
Cox, J.D.; Pilcher, G., Thermochemistry of Organic and Organometallic Compounds, Academic Press, New York, 1970, 1-636. [all data]

Conn, Kistiakowsky, et al., 1942
Conn, J.B.; Kistiakowsky, G.B.; Roberts, R.M.; Smith, E.A., Heats of organic reactions. XIII. Heats of hydrolysis of some acid anhydrides, J. Am. Chem. Soc., 1942, 64, 1747-17. [all data]