2-Buten-1-one, 1-(2,6,6-trimethyl-1-cyclohexen-1-yl)-

Normal alkane RI, non-polar column, temperature ramp

Data compiled by: NIST Mass Spectrometry Data Center, William E. Wallace, director

Column type CapillaryCapillaryCapillaryCapillaryCapillary
Active phase HP-5 MSHP-5 MSHP-5 MSHP-5 MSDB-5
Column length (m) 30.30.30.30.30.
Carrier gas HeliumHeliumHeliumHeliumHe
Substrate
Column diameter (mm) 0.250.250.250.250.32
Phase thickness (μm) 0.250.250.250.250.25
Tstart (C) 60.40.70.70.60.
Tend (C) 220.260.290.290.280.
Heat rate (K/min) 4.4.5.5.5.
Initial hold (min) 20.   0.5
Final hold (min) 20.5.10.10.2.
I 1394.1412.1420.1411.1415.
ReferenceFeizbakhsh and Naeemy, 2011Miyazawa, Marumoto, et al., 2011Radulovic, Blagojevic, et al., 2010Radulovic, Dordevic, et al., 2010Ozel, Gogus, et al., 2006
Comment MSDC-RI MSDC-RI MSDC-RI MSDC-RI MSDC-RI
Column type CapillaryCapillary
Active phase HP-5HP-1
Column length (m) 60.50.
Carrier gas HeHe
Substrate
Column diameter (mm) 0.320.2
Phase thickness (μm) 0.250.5
Tstart (C) 30.60.
Tend (C) 260.220.
Heat rate (K/min) 2.2.
Initial hold (min) 2.
Final hold (min) 28.40.
I 1419.31392.
ReferenceLeffingwell and Alford, 2005Valette, Fernandez, et al., 2003
Comment MSDC-RI MSDC-RI

Kovats' RI, non-polar column, isothermal

Data compiled by: NIST Mass Spectrometry Data Center, William E. Wallace, director

Column type CapillaryCapillaryCapillaryCapillary
Active phase SPB-1SPB-1SPB-1SPB-1
Column length (m) 37.37.37.37.
Carrier gas HeHeHeHe
Substrate
Column diameter (mm) 0.320.320.320.32
Phase thickness (μm) 0.250.250.250.25
Temperature (C) 132.143.152.162.
I 1395.1400.1406.1408.
ReferenceMisharina, Samusenko, et al., 2002Misharina, Samusenko, et al., 2002Misharina, Samusenko, et al., 2002Misharina, Samusenko, et al., 2002
Comment MSDC-RI MSDC-RI MSDC-RI MSDC-RI

References

Feizbakhsh and Naeemy, 2011
Feizbakhsh, A.; Naeemy, A., Volatile constituents of essential oils of Eleocharis pauciflora (Light) Link and Eleocharis uniglumis (Link) J.A. Schultes growing wild in Iran, Bull. Chem. Soc. Ethiop., 2011, 25, 3, 461-464, https://doi.org/10.4314/bcse.v25i3.68606 . [all data]

Miyazawa, Marumoto, et al., 2011
Miyazawa, M.; Marumoto, S.; Kobayashi, T.; Yoshida, S.; Utsumi, Y., Determination of characteristic components in essential oils from Wisteria braphybotrys using gas chromatography - olfactometry incremental dilution technique, Rec. Nat. Prod., 2011, 5, 3, 221-227. [all data]

Radulovic, Blagojevic, et al., 2010
Radulovic, N.; Blagojevic, P.; Palic, R., Comparative study of the leaf volatiles of Arctostaphylos uva-ursi (L.) Spreng. and Vaccinium vitis-idaea L. (Ericaceae), Molecules, 2010, 15, 9, 6168-6185, https://doi.org/10.3390/molecules15096168 . [all data]

Radulovic, Dordevic, et al., 2010
Radulovic, N.; Dordevic, N.; Markovic, M.; Palic, R., Volatile constituents of Glechoma Hirsuta Waldst. Kit. and G. Hederacea L. (Lamiaceae), Bull. Chem. Soc. Ethiop., 2010, 24, 1, 67-76, https://doi.org/10.4314/bcse.v24i1.52962 . [all data]

Ozel, Gogus, et al., 2006
Ozel, M.Z.; Gogus, F.; Lewis, A.C., Comparison of direct thermal desorption with water distillation and superheated water extraction for the analysis of volatile components of Rosa damascena Mill. using GCxGC-TOF/MS, Anal. Chim. Acta., 2006, 566, 2, 172-177, https://doi.org/10.1016/j.aca.2006.03.014 . [all data]

Leffingwell and Alford, 2005
Leffingwell, J.C.; Alford, E.D., Volatile constituents of Perique tobacco, Electron. J. Environ. Agric. Food Chem., 2005, 4, 2, 899-915. [all data]

Valette, Fernandez, et al., 2003
Valette, L.; Fernandez, X.; Poulain, S.; Loiseau, A.-M.; Lizzani-Cuvelier, L.; Levieil, R.; Restier, L., Volatile constituents from Romanesco cauliflower, Food Chem., 2003, 80, 3, 353-358, https://doi.org/10.1016/S0308-8146(02)00272-8 . [all data]