4-(Trifluoromethyl)benzyl alcohol

Phase change data

Data compiled by: Robert L. Brown and Stephen E. Stein

Reduced pressure boiling point

Tboil (K) Pressure (bar) Reference
352. - 353.0.005PCR Inc., 1990

Reaction thermochemistry data

Data compiled by: John E. Bartmess

Individual Reactions

C8H6F3O- + Hydrogen cation = 4-(Trifluoromethyl)benzyl alcohol

By formula: C8H6F3O- + H+ = C8H7F3O

Quantity Value Units Method Reference Comment
Δr1512. ± 8.8kJ/molG+TSMustanir, Than, et al., 2005gas phase
Quantity Value Units Method Reference Comment
Δr1484. ± 8.4kJ/molIMREMustanir, Than, et al., 2005gas phase

Gas phase ion energetics data

Data compiled by: John E. Bartmess

De-protonation reactions

C8H6F3O- + Hydrogen cation = 4-(Trifluoromethyl)benzyl alcohol

By formula: C8H6F3O- + H+ = C8H7F3O

Quantity Value Units Method Reference Comment
Δr1512. ± 8.8kJ/molG+TSMustanir, Than, et al., 2005gas phase
Quantity Value Units Method Reference Comment
Δr1484. ± 8.4kJ/molIMREMustanir, Than, et al., 2005gas phase

References

PCR Inc., 1990
PCR Inc., Research Chemicals Catalog 1990-1991, PCR Inc., Gainesville, FL, 1990, 1. [all data]

Mustanir, Than, et al., 2005
Mustanir; Than, S.; Mishima, M., Substituent effects on the gas phase acidity of phenylacetylenes and benzyl alcohols, Bull. Chem. Soc. Japan, 2005, 78, 1, 147-153, https://doi.org/10.1246/bcsj.78.147 . [all data]