Phenyl ketene

Gas phase ion energetics data

Data compiled as indicated in comments:
LL - Sharon G. Lias and Joel F. Liebman
LLK - Sharon G. Lias, Rhoda D. Levin, and Sherif A. Kafafi

Ionization energy determinations

IE (eV) Method Reference Comment
8.06 ± 0.02PESammynaiken and Westwood, 1989Vertical value; LL
8.17PEBock, Hirabayashi, et al., 1977Vertical value; LLK

References

Sammynaiken and Westwood, 1989
Sammynaiken, R.; Westwood, N.P.C., Hel photoelectron studies of unstable ketenes: Mono- and Di-phenylketenes, and their gas-phase conformations, J. Chem. Soc. Perkin Trans. 2, 1989, 1987. [all data]

Bock, Hirabayashi, et al., 1977
Bock, H.; Hirabayashi, T.; Mohmand, S.; Solouki, B., Instabile Zwischenprodukte in der Gasphase: Der thermische Zerfall von Carbonsaurechloriden RCOCl, Angew. Chem., 1977, 89, 106. [all data]