11-(1,1,3,3-Tetramethyldisiloxanyl)undecanoic acid, methyl ester

Phase change data

Data compiled by: William E. Acree, Jr., James S. Chickos

Enthalpy of fusion

ΔfusH (kJ/mol) Temperature (K) Reference
23.5233.3Ryabkov, Lebedev, et al., 2004

References

Ryabkov, Lebedev, et al., 2004
Ryabkov, M.V.; Lebedev, B.V.; Smirnova, N.N.; Agina, E.V.; Ponomarenko, S.A.; Makeev, E.A.; Boiko, N.I.; Shibaev, V.P., Zh. Fiz. Khim., 2004, 78, 11, 1950. [all data]