Phenol, 5-methoxy-2,3,4-trimethyl-

Normal alkane RI, polar column, custom temperature program

Data compiled by: NIST Mass Spectrometry Data Center, William E. Wallace, director

Column type Capillary
Active phase SOLGel-Wax
Column length (m) 30.
Carrier gas Helium
Substrate
Column diameter (mm) 0.53
Phase thickness (μm) 0.50
Program 40 0C 7 0C/min -> 180 0C 10 0C/min -> 240 0C (10 min)
I 2382.
ReferenceShu and Shen, 2008
Comment MSDC-RI

References

Shu and Shen, 2008
Shu, N.; Shen, H., Aroma-impact compounds in Lysimachia foenum-graecum extracts, Flavour Fragr. J., 2008, 24, 1, 1-6, https://doi.org/10.1002/ffj.1908 . [all data]