Benzenamine, 2,3,5,6-tetrachloro-

Phase change data

Data compiled by: William E. Acree, Jr., James S. Chickos

Quantity Value Units Method Reference Comment
Δsub20.6 ± 0.48kcal/molCRibeiro da Silva, Amaral, et al., 2007

References

Ribeiro da Silva, Amaral, et al., 2007
Ribeiro da Silva, M.A.V.; Amaral, L.M.P.F.; Gomes, J.R.B., Pol. J. Chem., 2007, 81, 5-6, 865. [all data]