(R)-deoxyephedrinium (S)-4'-fluoromandelate

Phase change data

Data compiled by: William E. Acree, Jr., James S. Chickos

Enthalpy of fusion

ΔfusH (kJ/mol) Temperature (K) Method Reference
27.9374.5DSCValente, Smith, et al., 2001

References

Valente, Smith, et al., 2001
Valente, Edward J.; Smith, Tyler N.; Harris, Marcus E., Discrimination in resolving systems. VI. Comparison of the diastereomers of deoxyephedrinium and ephedrinium 4?-fluoromandelates, Chirality, 2001, 13, 5, 244-250, https://doi.org/10.1002/chir.1026 . [all data]