Benzo[1,2-c:3,4-c':5,6-c'']tris[1,2,5]oxadiazole, 1,4,7-trioxide

Condensed phase thermochemistry data

Data compiled by: Hussein Y. Afeefy, Joel F. Liebman, and Stephen E. Stein

Quantity Value Units Method Reference Comment
Δfsolid606. ± 4.kJ/molCcbRouse, 1976
Quantity Value Units Method Reference Comment
Δcsolid-2967. ± 4.kJ/molCcbRouse, 1976

Phase change data

Data compiled by: William E. Acree, Jr., James S. Chickos

Enthalpy of sublimation

ΔsubH (kJ/mol) Temperature (K) Reference
172.0 ± 2.5363. - 433.Matyushin, Pepekin, et al., 1999

References

Rouse, 1976
Rouse, P.E., Jr., Enthalpies of formation and calculated detonation properties of some thermally stable explosives, J. Chem. Eng. Data, 1976, 21, 16-20. [all data]

Matyushin, Pepekin, et al., 1999
Matyushin, Y.N.; Pepekin, V.I.; Lebedev, V.P.; Chironov, V.V.; Kostikova, L.M.; Inozemtcev, Y.O.; Pivina, T.S.; Sheremetev, A.B., Thermochemical properties and quantum-chemical parameters of benzotrifurazan and its N-oxides, International Annual Conference of ICT, 1999, 30, 77/1. [all data]