Benzocyclobuten-1(2H)-one

Reaction thermochemistry data

Data compiled by: John E. Bartmess

Individual Reactions

C8H5O- + Hydrogen cation = Benzocyclobuten-1(2H)-one

By formula: C8H5O- + H+ = C8H6O

Quantity Value Units Method Reference Comment
Δr1505. ± 9.2kJ/molG+TSBroadus and Kass, 1999gas phase; Correction to direction of ΔGacid reported in literature: Kass, private communication
Quantity Value Units Method Reference Comment
Δr1473. ± 8.8kJ/molIMREBroadus and Kass, 1999gas phase; Correction to direction of ΔGacid reported in literature: Kass, private communication

Gas phase ion energetics data

Data compiled as indicated in comments:
B - John E. Bartmess
RDSH - Henry M. Rosenstock, Keith Draxl, Bruce W. Steiner, and John T. Herron

Ionization energy determinations

IE (eV) Method Reference Comment
8.99EIMamer, Lossing, et al., 1970RDSH

De-protonation reactions

C8H5O- + Hydrogen cation = Benzocyclobuten-1(2H)-one

By formula: C8H5O- + H+ = C8H6O

Quantity Value Units Method Reference Comment
Δr359.8 ± 2.2kcal/molG+TSBroadus and Kass, 1999gas phase; Correction to direction of ΔGacid reported in literature: Kass, private communication; B
Quantity Value Units Method Reference Comment
Δr352.1 ± 2.1kcal/molIMREBroadus and Kass, 1999gas phase; Correction to direction of ΔGacid reported in literature: Kass, private communication; B

References

Broadus and Kass, 1999
Broadus, K.M.; Kass, S.R., Benzocyclobutenone enolate: an anion with an antiaromatic resonance structure, J. Chem. Soc. Perkin Trans., 1999, 2, 11, 2389-2396, https://doi.org/10.1039/a905868k . [all data]