Tricyclo[4.3.1.0(1,6)]deca-2,4-diene

Reaction thermochemistry data

Data compiled by: Hussein Y. Afeefy, Joel F. Liebman, and Stephen E. Stein

Individual Reactions

Hydrogen + Tricyclo[4.3.1.0(1,6)]deca-2,4-diene = Tricyclo[4.3.1.0(1,6)]deca-2-ene

By formula: H2 + C10H12 = C10H14

Quantity Value Units Method Reference Comment
Δr-22.4kcal/molChydRoth, Klarner, et al., 1992liquid phase; solvent: Isooctane

Hydrogen + Tricyclo[4.3.1.0(1,6)]deca-2,4-diene = Tricyclo[4.3.1.0(1,6)deca-3-ene

By formula: H2 + C10H12 = C10H14

Quantity Value Units Method Reference Comment
Δr-22.6kcal/molChydRoth, Klarner, et al., 1992liquid phase; solvent: Isooctane

References

Roth, Klarner, et al., 1992
Roth, W.R.; Klarner, F.-G.; Siepert, G.; Lennartz, H.-W., Zur Frage der Homoaromatizitat von Norcaradien und Cycloheptatrien, Chem. Ber., 1992, 125, 217-224. [all data]