S,S-bis(trifluoromethyl)sulfoximine

Phase change data

Data compiled by: William E. Acree, Jr., James S. Chickos

Enthalpy of vaporization

ΔvapH (kcal/mol) Temperature (K) Method Reference
8.39346.ISauer and Shreeve, 1972

References

Sauer and Shreeve, 1972
Sauer, Dennis T.; Shreeve, Jean'ne M., Bis(perfluoroalkyl)sulfur oxyimines and silver bis(trifluoromethyl)sulfur oxyimine, Inorg. Chem., 1972, 11, 2, 238-242, https://doi.org/10.1021/ic50108a006 . [all data]