aluminium 2-methylpropanolate

Phase change data

Data compiled by: William E. Acree, Jr., James S. Chickos

Enthalpy of vaporization

ΔvapH (kcal/mol) Temperature (K) Method Reference Comment
33.32515.A,IStephenson and Malanowski, 1987Based on data from 500. - 550. K. See also Wilhoit, 1957.

References

Stephenson and Malanowski, 1987
Stephenson, Richard M.; Malanowski, Stanislaw, Handbook of the Thermodynamics of Organic Compounds, 1987, https://doi.org/10.1007/978-94-009-3173-2 . [all data]

Wilhoit, 1957
Wilhoit, R.C., Vapor Pressures of Some Aluminum, Alkoxides, J. Phys. Chem., 1957, 61, 1, 114-116, https://doi.org/10.1021/j150547a027 . [all data]