4-Benzhydryl-5,6-dimethyl-2,5-di(4'-methylphenyl)-1,3-dioxa-4-aza-2-boracyclohexane

Phase change data

Data compiled by: William E. Acree, Jr., James S. Chickos

Enthalpy of fusion

ΔfusH (kJ/mol) Temperature (K) Reference
32.48453.2Kliegel, Lubkowitz, et al., 2001

References

Kliegel, Lubkowitz, et al., 2001
Kliegel, Wolfgang; Lubkowitz, Gottfried; Pokriefke, Jens O.; Rettig, Steven J.; Trotter, James, Formation of heterocyclic arylboronates by thermally induced 1,4-aryl migration in diarylboron chelates of C-(1-hydro×yalkyl)nitrones. Crystal and molecular structures of some of the rearrangement products and of one of the educts, Revue canadienne de chimie, 2001, 79, 2, 226-237, https://doi.org/10.1139/cjc-79-2-226 . [all data]