CAS Reg. No. 34533-65-8

Reaction thermochemistry data

Data compiled by: John E. Bartmess

Individual Reactions

CAS Reg. No. 34533-65-8 + 2Ethane, nitro- = C6H15N3O6-

By formula: CAS Reg. No. 34533-65-8 + 2C2H5NO2 = C6H15N3O6-

Quantity Value Units Method Reference Comment
Δr14.60 ± 0.20kcal/molTDAsWincel, 2004gas phase
Quantity Value Units Method Reference Comment
Δr6.30kcal/molTDAsWincel, 2004gas phase

References

Wincel, 2004
Wincel, H., Gas-phase clustering reactions of NO2-, C2H3NO2-, C2H4NO2-C2H5NO2- and C2H5NO4- with C2H5NO2, Int. J. Mass Spectrom., 2004, 232, 2, 185-194, https://doi.org/10.1016/j.ijms.2004.01.003 . [all data]