Fluoranthene-picric acid

Phase change data

Data compiled as indicated in comments:
TRC - Thermodynamics Research Center, NIST Boulder Laboratories, Chris Muzny director
DH - Eugene S. Domalski and Elizabeth D. Hearing

Quantity Value Units Method Reference Comment
Tfus462.4KN/AFarrell and Shahidi, 1979Crystal phase 1 phase; Uncertainty assigned by TRC = 0.6 K; TRC

Enthalpy of fusion

ΔfusH (kJ/mol) Temperature (K) Reference Comment
24.700462.4Farrell, Shahidi, et al., 1979DH

Entropy of fusion

ΔfusS (J/mol*K) Temperature (K) Reference Comment
53.4462.4Farrell, Shahidi, et al., 1979DH

Enthalpy of phase transition

ΔHtrs (kJ/mol) Temperature (K) Initial Phase Final Phase Reference Comment
13.800365.6crystaline, IIcrystaline, IFarrell, Shahidi, et al., 1979DH

Entropy of phase transition

ΔStrs (J/mol*K) Temperature (K) Initial Phase Final Phase Reference Comment
37.7365.6crystaline, IIcrystaline, IFarrell, Shahidi, et al., 1979DH

In addition to the Thermodynamics Research Center (TRC) data available from this site, much more physical and chemical property data is available from the following TRC products:

References

Farrell and Shahidi, 1979
Farrell, P.G.; Shahidi, F., DSC studies of aromatic hydrocarbon picrates, Thermochim. Acta, 1979, 33, 275. [all data]

Farrell, Shahidi, et al., 1979
Farrell, P.G.; Shahidi, F.; Casellato, F.; Vecchi, C.; Girelli, A., DSC studies of aromatic hydrocarbon picrates, Thermochim. Acta, 1979, 33, 275-280. [all data]