BH3 radical anion

Vibrational and/or electronic energy levels

Data compiled by: Marilyn E. Jacox

State:   ?

 Energy
 (cm-1
 Med.   Transition   λmin
 (nm)
 λmax
 (nm)

References

Td = 310 ± 120 gas Wickham-Jones, Moran, et al., 1989

Additional references: Jacox, 1994, page 125

Wickham-Jones, Moran, et al., 1989
Wickham-Jones, C.T.; Moran, S.; Ellison, G.B., Photoelectron Spectroscopy of BH3-, J. Chem. Phys., 1989, 90, 2, 795, https://doi.org/10.1063/1.456104 . [all data]

Jacox, 1994
Jacox, M.E., Vibrational and electronic energy levels of polyatomic transient molecules, American Chemical Society, Washington, DC, 1994, 464. [all data]