Diazene, phenyl(trimethylgermyl)-

Gas phase ion energetics data

Data compiled by: Sharon G. Lias, Rhoda D. Levin, and Sherif A. Kafafi

Ionization energy determinations

IE (eV) Method Reference Comment
7.7 ± 0.2PEBock, Wittel, et al., 1976Vertical value

References

Bock, Wittel, et al., 1976
Bock, H.; Wittel, K.; Veith, M.; Wiberg, N., Photoelectron spectra and molecular properties. L.1-3 On the blue color of bis(trimethylsilyl)diimine, J. Am. Chem. Soc., 1976, 98, 109. [all data]