Kaurene

Normal alkane RI, polar column, custom temperature program

Data compiled by: NIST Mass Spectrometry Data Center, William E. Wallace, director

Column type Capillary
Active phase HP Innowax
Column length (m) 60.
Carrier gas
Substrate
Column diameter (mm) 0.25
Phase thickness (μm) 0.33
Program not specified
I 2399.
ReferenceNoorizadeh and Farmany, 2010
Comment MSDC-RI

Kovats' RI, non-polar column, isothermal

View large format table.

Column type Active phase Temperature (C) I Reference Comment
CapillaryOV-101170.2019.Clarke, Perry, et al., 1994

Kovats' RI, polar column, isothermal

View large format table.

Column type Active phase Temperature (C) I Reference Comment
CapillaryCarbowax 20M170.2350.Perry and Weavers, 1984
CapillaryCarbowax 20M190.2393.Perry and Weavers, 1984

Van Den Dool and Kratz RI, non-polar column, temperature ramp

View large format table.

Column type Active phase I Reference Comment
CapillaryHP-52043.Quijano, Salamanca, et al., 200730. m/0.25 mm/0.25 μm, He, 50. C @ 4. min, 4. K/min, 250. C @ 10. min
CapillaryDB-52034.Block, Flamini, et al., 200630. m/0.25 mm/0.25 μm, He, 3. K/min; Tstart: 60. C; Tend: 240. C
CapillaryDB-52041.Dob, Dahmane, et al., 200630. m/0.32 mm/0.25 μm, N2, 60. C @ 3. min, 3. K/min, 240. C @ 5. min
CapillaryDB-52043.Su, Ho, et al., 200630. m/0.25 mm/0.25 μm, He, 50. C @ 2. min, 5. K/min; Tend: 250. C
CapillaryHP-5MS2043.Grujic-Jovanovic, Skaltsa, et al., 200430. m/0.25 mm/0.25 μm, He, 60. C @ 5. min, 4. K/min; Tend: 280. C
CapillaryHP-52036.Skaltsa, Demetzos, et al., 200330. m/0.25 mm/0.25 μm, He, 60. C @ 5. min, 4. K/min; Tend: 280. C
CapillaryHP-5MS2034.Demetzos, Angelopoulou, et al., 200230. m/0.25 mm/0.25 μm, 50. C @ 5. min, 3. K/min; Tend: 280. C
CapillaryDB-52034.Javidnia, Miri, et al., 200230. m/0.25 mm/0.25 μm, He, 4. K/min; Tstart: 60. C; Tend: 260. C

Normal alkane RI, non-polar column, temperature ramp

View large format table.

Column type Active phase I Reference Comment
CapillaryDB-5 MS2045.Cui, Yang, et al., 201130. m/0.25 mm/0.25 μm, Helium, 3. K/min; Tstart: 60. C; Tend: 270. C
CapillaryDB-52043.Ho, Wang, et al., 201030. m/0.25 mm/0.25 μm, Helium, 2. K/min; Tstart: 50. C; Tend: 250. C
CapillaryDB-52034.Magalhaes, Lima, et al., 201030. m/0.25 mm/0.25 μm, Helium, 3. K/min; Tstart: 60. C; Tend: 240. C
CapillaryZB-52008.Gardini, Beletti, et al., 200930. m/0.25 mm/0.25 μm, Helium, 3. K/min, 240. C @ 1. min; Tstart: 50. C
CapillaryHP-52038.Bousaada, Ammar, et al., 200830. m/0.25 mm/0.25 μm, Nitrogen, 50. C @ 1. min, 5. K/min, 280. C @ 1. min
CapillaryDB-52071.Smelcerovic, Spiteller, et al., 200730. m/0.25 mm/0.25 μm, He, 10. K/min, 320. C @ 4. min; Tstart: 60. C
CapillaryAT-52036.Borges, Rojas, et al., 200660. m/0.25 mm/0.25 μm, He, 4. K/min, 200. C @ 20. min; Tstart: 60. C
CapillaryDB-5MS2012.Maronigiu, Piras, et al., 200630. m/0.25 mm/0.25 μm, He, 3. K/min, 280. C @ 30. min; Tstart: 60. C
CapillaryHP-5MS2048.Petrovic, Ristic, et al., 200630. m/0.25 mm/0.25 μm, He, 4. K/min; Tstart: 40. C; Tend: 260. C
CapillaryDB-52027.Lopez Arze, Collin, et al., 200430. m/0.25 mm/0.25 μm, 40. C @ 2. min, 2. K/min, 210. C @ 33. min
CapillaryDB-52034.Pino, Marbot, et al., 200330. m/0.25 mm/0.25 μm, H2, 60. C @ 10. min, 4. K/min, 280. C @ 40. min
CapillaryDB-52025.Priestap, van Baren, et al., 200330. m/0.2 mm/0.25 μm, He, 75. C @ 4. min, 3. K/min; Tend: 220. C

Normal alkane RI, non-polar column, custom temperature program

View large format table.

Column type Active phase I Reference Comment
CapillaryTR-5 MS2014.Kurashov, Mitrukova, et al., 201415. m/0.25 mm/0.25 μm, Helium; Program: 35 0C (3 min) 2 0C/min -> 60 0C (3 min) 2 0C/min -> 80 0C (3 min) 4 0C/min -> 120 0C (3 min) 5 0C/min -> 150 0C (3 min) 15 0C/min -> 240 0C (10 min)
CapillaryTR-5 MS2023.Kurashov, Krylova, et al., 201315. m/0.25 mm/0.25 μm, Helium; Program: 35 0C (3 min) 2 0C/min -> 60 0C (3 min) 2 0C/min -> 80 0C (3 min) 4 0C/min -> 120 0C (3 min) 5 0C/min -> 150 0C (3 mion) 15 0C/min -> 240 0C (10 min)
CapillaryHP-5MS2025.Cole, Haber, et al., 200730. m/0.25 mm/0.25 μm, He; Program: 40C(10min) => 3C/min => 200C => 2C/min => 220C
CapillaryHP-5 MS2025.Moriarity, Bansal, et al., 200730. m/0.25 mm/0.25 μm, Helium; Program: 40 0C (10 min) 3 0C/min -> 200 0C 2 0C/min -> 220 0C
CapillaryDB-52043.Nivinsliene, Butkiene, et al., 200750. m/0.32 mm/0.25 μm, Helium; Program: 60 0C (1 min) 5 0C/min -> 160 0C 10 0C/min -> 250 0C
CapillaryHP-5MS2034.Takaku, Haber, et al., 2007He; Column length: 30. m; Column diameter: 0.25 mm; Program: 40C(10min) => 3C/min => 200C => 2C/min => 220C

Normal alkane RI, polar column, temperature ramp

View large format table.

Column type Active phase I Reference Comment
CapillaryHP-Innowax2425.Bousaada, Ammar, et al., 200830. m/0.25 mm/0.25 μm, Nitrogen, 50. C @ 1. min, 5. K/min, 280. C @ 1. min
CapillarySupelcowax-102351.Lopez Arze, Collin, et al., 200430. m/0.25 mm/0.25 μm, 40. C @ 2. min, 2. K/min, 210. C @ 33. min

References

Noorizadeh and Farmany, 2010
Noorizadeh, H.; Farmany, A., Exploration of linear and nonlinear modeling techniques to predict of retention index of essential oils, J. Chin. Chem. Soc., 2010, 1268-1277. [all data]