2-pentyl-1,3-butadiene

Phase change data

Data compiled by: Thermodynamics Research Center, NIST Boulder Laboratories, Chris Muzny director

Quantity Value Units Method Reference Comment
Tboil422.KN/AMarvel, Myers, et al., 1948Uncertainty assigned by TRC = 2. K

In addition to the Thermodynamics Research Center (TRC) data available from this site, much more physical and chemical property data is available from the following TRC products:

References

Marvel, Myers, et al., 1948
Marvel, C.S.; Myers, R.L.; Saunders, J.H., The Preparatioan of 2-Alkylbutadienes, J. Am. Chem. Soc., 1948, 70, 1694. [all data]