Silane, ethyltrimethyl-

Gas phase ion energetics data

Data compiled as indicated in comments:
LLK - Sharon G. Lias, Rhoda D. Levin, and Sherif A. Kafafi
RDSH - Henry M. Rosenstock, Keith Draxl, Bruce W. Steiner, and John T. Herron

Ionization energy determinations

IE (eV) Method Reference Comment
9.6PEPotzinger, Ritter, et al., 1975LLK
9.70 ± 0.01EIHess, Lampe, et al., 1965RDSH

Appearance energy determinations

Ion AE (eV) Other Products MethodReferenceComment
C3H9Si+10.0 ± 0.1C2H5EIPotzinger, Ritter, et al., 1975LLK
C3H9Si+10.34 ± 0.11?EIConnor, Finney, et al., 1966RDSH
C3H9Si+10.53 ± 0.09?EIHess, Lampe, et al., 1964RDSH
C4H11Si+11.41 ± 0.06CH3EIHess, Lampe, et al., 1965RDSH

Kovats' RI, non-polar column, isothermal

Data compiled by: NIST Mass Spectrometry Data Center, William E. Wallace, director

Column type Capillary
Active phase Apiezon L
Column length (m)
Carrier gas
Substrate
Column diameter (mm)
Phase thickness (μm)
Temperature (C) 160.
I 550.
ReferencePeetre and Smith, 1974
Comment MSDC-RI

References

Potzinger, Ritter, et al., 1975
Potzinger, P.; Ritter, A.; Krause, J., Massenspektrometrische Bestimmung von Bindungsenergien in siliciumorganischen Verbindungen, Z. Naturforsch. A:, 1975, 30, 347. [all data]

Hess, Lampe, et al., 1965
Hess, G.G.; Lampe, F.W.; Sommer, L.H., An electron impact study of ionization and dissociation of trimethylsilanes, J. Am. Chem. Soc., 1965, 87, 5327. [all data]

Connor, Finney, et al., 1966
Connor, J.A.; Finney, G.; Leigh, G.J.; Haszeldine, R.N.; Robinson, P.J.; Sedgwick, R.D.; Simmons, R.F., Bond dissociation energies in organosilicon compounds, Chem. Commun., 1966, 178. [all data]

Hess, Lampe, et al., 1964
Hess, G.G.; Lampe, F.W.; Sommer, L.H., Bond dissociation energies and ion energetics in organosilicon compounds by electron impact, J. Am. Chem. Soc., 1964, 86, 3174. [all data]