Pyrimidine, 4-methyl-

Phase change data

Data compiled as indicated in comments:
BS - Robert L. Brown and Stephen E. Stein
AC - William E. Acree, Jr., James S. Chickos

Quantity Value Units Method Reference Comment
Tboil415.2KN/AWeast and Grasselli, 1989BS
Quantity Value Units Method Reference Comment
Δvap44.2 ± 2.4kJ/molCGCLipkind and Chickos, 2009Based on data from 342. - 373. K.; AC

Van Den Dool and Kratz RI, non-polar column, custom temperature program

Data compiled by: NIST Mass Spectrometry Data Center, William E. Wallace, director

Column type Capillary
Active phase ZB-5
Column length (m) 30.
Carrier gas He
Substrate
Column diameter (mm) 0.25
Phase thickness (μm) 0.25
Program 50C(1min) => 3C/min => 209C => 20C/min => 280C
I 853.
ReferenceLu, Hao, et al., 2005
Comment MSDC-RI

References

Weast and Grasselli, 1989
CRC Handbook of Data on Organic Compounds, 2nd Editon, Weast,R.C and Grasselli, J.G., ed(s)., CRC Press, Inc., Boca Raton, FL, 1989, 1. [all data]

Lipkind and Chickos, 2009
Lipkind, Dmitri; Chickos, James S., An examination of the vaporization enthalpies and vapor pressures of pyrazine, pyrimidine, pyridazine, and 1,3,5-triazine, Struct Chem, 2009, 20, 1, 49-58, https://doi.org/10.1007/s11224-008-9389-5 . [all data]

Marshall and Walker, 1951
Marshall, J.R.; Walker, J., J. Chem. Soc., 1951, 1004. [all data]