Benzonitrile, 4-ethenyl-

Phase change data

Data compiled by: Thermodynamics Research Center, NIST Boulder Laboratories, Chris Muzny director

Quantity Value Units Method Reference Comment
Tfus258.15KN/AMowry, Renoll, et al., 1946Uncertainty assigned by TRC = 2. K

In addition to the Thermodynamics Research Center (TRC) data available from this site, much more physical and chemical property data is available from the following TRC products:

References

Mowry, Renoll, et al., 1946
Mowry, D.T.; Renoll, M.; Huber, W.F., Vinyl Aromatic Compounds I. The Vapor Phase Dehydration of Arylmethylcarbinols, J. Am. Chem. Soc., 1946, 68, 1105. [all data]