Imidodiphosphorous tetrafluoride

Gas phase ion energetics data

Data compiled by: Sharon G. Lias, Rhoda D. Levin, and Sherif A. Kafafi

Ionization energy determinations

IE (eV) Method Reference Comment
11.3 ± 0.1PEArnold and Rankin, 1975Vertical value

References

Arnold and Rankin, 1975
Arnold, D.E.J.; Rankin, D.W.H., Preparation and properties of bis(difluorophosphino)- and tris(difluorophosphino)-amine, J. Chem. Soc. Dalton Trans., 1975, 889. [all data]