2-Cyclohexen-1-one, 4-(3-hydroxy-1-butenyl)-3,5,5-trimethyl-

Normal alkane RI, polar column, custom temperature program

Data compiled by: NIST Mass Spectrometry Data Center, William E. Wallace, director

Column type CapillaryCapillaryCapillaryCapillaryCapillary
Active phase DB-Wax EtrDB-WaxDB-WaxCP-Wax 52CBCP-Wax 52 CB
Column length (m) 60. 30.25.30.
Carrier gas He HeH2H2
Substrate
Column diameter (mm) 0.25 0.320.30.32
Phase thickness (μm) 0.5 0.51.2
Program 40C(3min) => 10C/min => 90C => 2C/min => 230C (37min)not specified60C(2min) => 2C/min => 220C => 3C/min => 245C(20min)60C(3min) => 2C/min => 220C => 3C/min => 245C60 0C 2 0C/min -> 220 0C 3 0C/min -> 245 0C
I 2657.2639.2677.2637.2637.
ReferenceLoskos, Hernandez-Orte, et al., 2007Osorio, Duque, et al., 2003Selli, Cabaroglu, et al., 2003López-Tamames, Carro-Mariño, et al., 1997Carro Marino, López Tamames, et al., 1995
Comment MSDC-RI MSDC-RI MSDC-RI MSDC-RI MSDC-RI
Column type Capillary
Active phase DB-Wax
Column length (m) 30.
Carrier gas
Substrate
Column diameter (mm) 0.25
Phase thickness (μm) 0.25
Program not specified
I 2644.
ReferenceMarlatt, Ho, et al., 1992
Comment MSDC-RI

Normal alkane RI, non-polar column, temperature ramp

Data compiled by: NIST Mass Spectrometry Data Center, William E. Wallace, director

Column type CapillaryCapillaryCapillaryCapillaryCapillary
Active phase HP-5 MSHP-5 MSSPB-5HP-1BPX-5
Column length (m) 30.30.30.25.50.
Carrier gas HeliumHeliumHeHeHe
Substrate
Column diameter (mm) 0.250.250.530.20.22
Phase thickness (μm) 0.250.25 0.330.25
Tstart (C) 70.70.100.50.50.
Tend (C) 200.200.250.300.250.
Heat rate (K/min) 3.3.5.4.3.
Initial hold (min) 2.2.  1.
Final hold (min) 18.18.  10.
I 1656.1660.1682.1611.1668.
ReferenceJerkovic and Marijanovic, 2010Jerkovic, Tuberso, et al., 2010Kilic, Kollmannsberger, et al., 2005Osorio, Duque, et al., 2003D'Arcy, Rintoul, et al., 1997
Comment MSDC-RI MSDC-RI MSDC-RI MSDC-RI MSDC-RI
Column type Capillary
Active phase DB5-30W
Column length (m) 30.
Carrier gas He
Substrate
Column diameter (mm) 0.25
Phase thickness (μm) 0.25
Tstart (C) 60.
Tend (C) 300.
Heat rate (K/min) 5.
Initial hold (min)
Final hold (min)
I 1645.
ReferenceSchwab and Schreier, 1988
Comment MSDC-RI

References

Loskos, Hernandez-Orte, et al., 2007
Loskos, N.; Hernandez-Orte, P.; Cacho, J.; Ferreira, V., Release and formation of varietal aroma compounds during alcoholic fermentation from nonfloral grape odorless flavor precursors fractions, J. Agric. Food Chem., 2007, 55, 16, 6674-6684, https://doi.org/10.1021/jf0702343 . [all data]

Osorio, Duque, et al., 2003
Osorio, C.; Duque, C.; Batista-Viera, F., Studies on aroma generation in lulo (Solanum quitoense): enzymatic hydrolysis of glycosides from leaves, Food Chem., 2003, 81, 3, 333-340, https://doi.org/10.1016/S0308-8146(02)00427-2 . [all data]

Selli, Cabaroglu, et al., 2003
Selli, s.; Cabaroglu, T.; Canbas, A., Flavour components of orange wine made from a Turkish cv. Kozan, Int. J. Food Sci. Technol., 2003, 38, 5, 587-593, https://doi.org/10.1046/j.1365-2621.2003.00691.x . [all data]

López-Tamames, Carro-Mariño, et al., 1997
López-Tamames, E.; Carro-Mariño, N.; Gunata, Y.Z.; Sapis, C.; Baumes, R.; Bayonove, C., Potential aroma in several varieties of Spanish grapes, J. Agric. Food Chem., 1997, 45, 5, 1729-1735, https://doi.org/10.1021/jf960572w . [all data]

Carro Marino, López Tamames, et al., 1995
Carro Marino, N.; López Tamames, E.; García Jares, C.M., Contribution to the study of the aromatic potential of three muscat Vitis vinifera varieties: identification of new compounds, Food Sci. Technol. Int., 1995, 1, 2-3, 105-116, https://doi.org/10.1177/108201329500100206 . [all data]

Marlatt, Ho, et al., 1992
Marlatt, C.; Ho, C.-T.; Chien, M., Studies of aroma constituents bound as glycosides in tomato, J. Agric. Food Chem., 1992, 40, 2, 249-252, https://doi.org/10.1021/jf00014a016 . [all data]