3-Mercapto-3-methylbutanol

Van Den Dool and Kratz RI, polar column, temperature ramp

Data compiled by: NIST Mass Spectrometry Data Center, William E. Wallace, director

Column type CapillaryCapillary
Active phase BP-20DB-Wax
Column length (m) 50.30.
Carrier gas  He
Substrate
Column diameter (mm) 0.220.25
Phase thickness (μm) 0.250.25
Tstart (C) 45.40.
Tend (C) 230.240.
Heat rate (K/min) 3.6.
Initial hold (min) 10.10.
Final hold (min) 20.25.
I 1677.1658.
ReferenceSarrazin E., Shinkaruk S., et al., 2007Varming, Petersen, et al., 2004
Comment MSDC-RI MSDC-RI

Normal alkane RI, non-polar column, custom temperature program

View large format table.

Column type Active phase I Reference Comment
CapillaryCP-Sil 5 CB938.Gros, Nizet, et al., 201150. m/0.32 mm/1.20 μm, Nitrogen; Program: 36 0C 20 0C/min -> 85 0C 1 0C/min -> 145 0C 3 0C/min -> 250 0C (30 min)
CapillaryCP Sil 5 CB944.Vermeulen, Lejeune, et al., 200650. m/0.32 mm/1.2 μm; Program: 40C(4min) => 2C/min => 132C => 10C/min => 250C (15min)
CapillaryDB-5972.Acree and Arn, 2004Program: not specified
CapillaryCP Sil 5 CB944.Vermeulen, Guyot-Declerck, et al., 200350. m/0.32 mm/1.2 μm, He; Program: 40C(4min) => 2C/min => 132C => 10C/min => 250C(45min)

Normal alkane RI, polar column, custom temperature program

View large format table.

Column type Active phase I Reference Comment
CapillaryFFAP1671.Vermeulen, Lejeune, et al., 200625. m/0.32 mm/0.3 μm; Program: 40C(4min) => 2C/min => 132C => 10C/min => 250C (15min)
CapillaryFFAP1671.Vermeulen, Guyot-Declerck, et al., 200325. m/0.32 mm/0.3 μm; Program: 40C(4min) => 2C/min => 132C => 10C/min => 250C(15min)

References

Sarrazin E., Shinkaruk S., et al., 2007
Sarrazin E.; Shinkaruk S.; Bennetau B.; Frerot E.; Dubourdieu D., Odorous impact of volatile thiols on the aroma of young botrytized sweet wines: Identification and quantification of new sulfanyl alcohols, J. Agric. Food Chem., 2007, 55, 4, 1437-1444, https://doi.org/10.1021/jf062582v . [all data]

Varming, Petersen, et al., 2004
Varming, C.; Petersen, M.A.; Poll, L., Comparison of isolation methods for the determination of important aroma compounds in black currant (Ribes nigrum L.) juice, using nasal impact frequency profiling, J. Agric. Food Chem., 2004, 52, 6, 1647-1652, https://doi.org/10.1021/jf035133t . [all data]