Isopropyltrimethylsilane

Gas phase ion energetics data

Data compiled by: Henry M. Rosenstock, Keith Draxl, Bruce W. Steiner, and John T. Herron

Ionization energy determinations

IE (eV) Method Reference
9.50 ± 0.03EIHess, Lampe, et al., 1965

Appearance energy determinations

Ion AE (eV) Other Products MethodReferenceComment
C3H9Si+10.56 ± 0.16?EIHess, Lampe, et al., 1964

References

Hess, Lampe, et al., 1965
Hess, G.G.; Lampe, F.W.; Sommer, L.H., An electron impact study of ionization and dissociation of trimethylsilanes, J. Am. Chem. Soc., 1965, 87, 5327. [all data]

Hess, Lampe, et al., 1964
Hess, G.G.; Lampe, F.W.; Sommer, L.H., Bond dissociation energies and ion energetics in organosilicon compounds by electron impact, J. Am. Chem. Soc., 1964, 86, 3174. [all data]