Benzaldehyde, 3-ethyl-

Normal alkane RI, non-polar column, custom temperature program

View large format table.

Column type Active phase I Reference Comment
CapillaryHP-5 MS1168.Xie, Sun, et al., 200830. m/0.25 mm/0.25 μm, Helium; Program: 40 0C (2 min) 4 0C/min -> 220 0C 20 0C/min -> 280 0C

References

Xie, Sun, et al., 2008
Xie, J.; Sun, B.; Zheng, F.; Wang, S., Volatile flavor constituents in roasted pork of mini-pig, Food Chem., 2008, 109, 3, 506-514, https://doi.org/10.1016/j.foodchem.2007.12.074 . [all data]