cis-1,3,5-Trimethyl-1,3,5-triphenylcyclotrisiloxane

Condensed phase thermochemistry data

Data compiled by: Eugene S. Domalski and Elizabeth D. Hearing

Quantity Value Units Method Reference Comment
solid,1 bar571.1J/mol*KN/AMekhtiev, Karasharli, et al., 1975

Constant pressure heat capacity of solid

Cp,solid (J/mol*K) Temperature (K) Reference Comment
538.5298.15Mekhtiev, Karasharli, et al., 1975T = 13 to 390 K.

Phase change data

Data compiled as indicated in comments:
TRC - Thermodynamics Research Center, NIST Boulder Laboratories, Chris Muzny director
AC - William E. Acree, Jr., James S. Chickos
DH - Eugene S. Domalski and Elizabeth D. Hearing

Quantity Value Units Method Reference Comment
Ttriple373.2KN/AMekhtiev and Karasharli, 1981Uncertainty assigned by TRC = 0.1 K; TRC

Enthalpy of vaporization

ΔvapH (kJ/mol) Temperature (K) Reference Comment
80.6512.Ditsent, Skorokhodov, et al., 1972Based on data from 473. - 551. K.; AC

Enthalpy of fusion

ΔfusH (kJ/mol) Temperature (K) Reference Comment
43.070374.4Mekhtiev, Karasharli, et al., 1975DH
43.07374.3Domalski and Hearing, 1996See also Mekhtiev, Karasharli, et al., 1975, 2.; AC

Entropy of fusion

ΔfusS (J/mol*K) Temperature (K) Reference Comment
115.5374.4Mekhtiev, Karasharli, et al., 1975DH

In addition to the Thermodynamics Research Center (TRC) data available from this site, much more physical and chemical property data is available from the following TRC products:

References

Mekhtiev, Karasharli, et al., 1975
Mekhtiev, S.A.; Karasharli, K.A.; Dzhafarov, O.I.; Kuznetsova, A.G., True heat capacities of cis- and trans-1,3,5-trimethyl-1,3,5-triphenylcyclotrisiloxanes, Zhur. Fiz. Khim., 1975, 49, 1914-1916. [all data]

Mekhtiev and Karasharli, 1981
Mekhtiev, S.A.; Karasharli, K.A., Analysis of the results of thermodynamic studies of a series of organosilicon compounds, Azerb. Khim. Zhur., 1981, (5), 85-88. [all data]

Ditsent, Skorokhodov, et al., 1972
Ditsent, V.E.; Skorokhodov, I.I.; Terent'eva, N.A.; Zolotareva, M.N., Russ. J. Phys. Chem., 1972, 46, 2, 317. [all data]

Domalski and Hearing, 1996
Domalski, Eugene S.; Hearing, Elizabeth D., Heat Capacities and Entropies of Organic Compounds in the Condensed Phase. Volume III, J. Phys. Chem. Ref. Data, 1996, 25, 1, 1, https://doi.org/10.1063/1.555985 . [all data]

Mekhtiev, Karasharli, et al., 1975, 2
Mekhtiev, S.A.; Karasharli, K.A.; Dzhafarov, D.I.; Kuznetsova, A.G., Russ. J. Phys. Chem., 1975, 49, 1914. [all data]