Thallium nonanoate

Condensed phase thermochemistry data

Data compiled by: Eugene S. Domalski and Elizabeth D. Hearing

Constant pressure heat capacity of solid

Cp,solid (J/mol*K) Temperature (K) Reference Comment
393.310.Roux, Turrion, et al., 1989T = 310 to 485 K.

Phase change data

Data compiled by: Eugene S. Domalski and Elizabeth D. Hearing

Enthalpy of phase transition

ΔHtrs (kJ/mol) Temperature (K) Initial Phase Final Phase Reference Comment
1.039259.3crystaline, Vcrystaline, IVRoux, Turrion, et al., 1989
1.563299.8crystaline, IVcrystaline, IIIRoux, Turrion, et al., 1989
2.860315.7crystaline, IIIcrystaline, IIRoux, Turrion, et al., 1989
6.934332.2crystaline, IIcrystaline, IRoux, Turrion, et al., 1989
6.053410.9crystaline, IliquidRoux, Turrion, et al., 1989
1.674300.crystaline, IVcrystaline, IIIMeisel, Seybold, et al., 1976
2.636315.crystaline, IIIcrystaline, IIMeisel, Seybold, et al., 1976
7.531330.crystaline, IIcrystaline, IMeisel, Seybold, et al., 1976
2.552490.liquidliquidMeisel, Seybold, et al., 1976
5.021410.crystaline, IliquidMeisel, Seybold, et al., 1976

Entropy of phase transition

ΔStrs (J/mol*K) Temperature (K) Initial Phase Final Phase Reference Comment
3.99259.3crystaline, Vcrystaline, IVRoux, Turrion, et al., 1989
5.24299.8crystaline, IVcrystaline, IIIRoux, Turrion, et al., 1989
9.06315.7crystaline, IIIcrystaline, IIRoux, Turrion, et al., 1989
20.87332.2crystaline, IIcrystaline, IRoux, Turrion, et al., 1989
14.72410.9crystaline, I, Solidliquid, mesophaseRoux, Turrion, et al., 1989
5.44300.crystaline, IVcrystaline, IIIMeisel, Seybold, et al., 1976
8.37315.crystaline, IIIcrystaline, IIMeisel, Seybold, et al., 1976
22.2330.crystaline, IIcrystaline, IMeisel, Seybold, et al., 1976
5.02490.liquid, Mesophaseliquid, isotropicMeisel, Seybold, et al., 1976
12.1410.crystaline, I, Solidliquid, mesophaseMeisel, Seybold, et al., 1976

References

Roux, Turrion, et al., 1989
Roux, M.V.; Turrion, C.; Fernandez-Martin, F.; Lopez de la Fuente, F.L.; Cheda, J.A.R., DSC thermophysics on osme medium chain thallium(I) n-alkanoates: Phase transitions, thermal functions and heat capacity, Thermochim. Acta, 1989, 139, 139-148. [all data]

Meisel, Seybold, et al., 1976
Meisel, T.; Seybold, K.; Halmos, Z.; Roth, J.; Melykuti, C., Thermal behavior of thallium(I) fatty acid salts. I, J. Therm. Anal., 1976, 10, 419-431. [all data]