Imidodiphosphorous acid, methyl-, tetramethyl ester

Gas phase ion energetics data

Data compiled by: Sharon G. Lias and Joel F. Liebman

Ionization energy determinations

IE (eV) Method Reference Comment
8.39PEPradeep and Hedge, 1990Vertical value

References

Pradeep and Hedge, 1990
Pradeep, T.; Hedge, M.S., Electronic structures of RN(PX2)2 (R=CH3 or C6H5; X=Cl, OCH3 or OC6H5) ligands: an ultraviolet photoelectron spectroscopic study, J. Electron Spectrosc. Relat. Phenom., 1990, 53, 119. [all data]